BDBM36760 6-(3-chloroanilino)-9-isopropylpurine core C2-substituent, 305
SMILES CC(O)CN(CC(C)O)c1nc2N(CNc2c(Nc2cccc(Cl)c2)n1)C(C)C
InChI Key InChIKey=HZSXKAUBEFDORQ-UHFFFAOYSA-N
Data  1 IC50
  Tab Delimited (TSV)   2D SDfile   Computed 3D by Vconf -m prep SDfile
Find this compound or compounds like it in BindingDB:
Activity Spreadsheet -- Enzyme Inhibition Constant Data from BindingDB
Found 1 hit for monomerid = 36760
TargetCyclin-dependent kinase 1(Homo sapiens (Human))
University of California Berkeley
LigandPNGBDBM36760(6-(3-chloroanilino)-9-isopropylpurine core C2-subs...)
Affinity DataIC50:  350nM. Assay description: Inhibition assay using CDK1/cyclin B.
In DepthDetails ArticlePubMed